1 Reply Latest reply on Oct 15, 2015 6:46 AM by Richard Moeller

    problem with job $175APCF

    Mohammad Rababah

      I’ve started the installation of the Mainview products started with “Common Installation PUT1402B” and I’ve problem with job $175APCF. I’ve received code 12 below are messages received


      GIM30209E ** APPLY PROCESSING FAILED FOR SYSMOD BBACM20. REQUIRED SYSMODS FAILED

      GIM35919I CONDITIONAL REQUISITE SYSMOD BPA0874 FAILED. SYSMOD BBIIS25 CONTAIN

      GIM35919I CONDITIONAL REQUISITE SYSMOD BPA0874 FAILED. SYSMOD BBISS26 CONTAIN

      GIM35919I CONDITIONAL REQUISITE SYSMOD BPA1562 FAILED. SYSMOD ZBBA220 CONTAIN

      GIM35919I CONDITIONAL REQUISITE SYSMOD BPA1630 FAILED. SYSMOD ZBBA220 CONTAIN

      GIM35919I CONDITIONAL REQUISITE SYSMOD BPA1649 FAILED. SYSMOD ZBBA220 CONTAIN

      GIM35919I CONDITIONAL REQUISITE SYSMOD BPA1655 FAILED. SYSMOD ZBBA220 CONTAIN

      GIM35955I CONDITIONAL REQUISITE SYSMOD BPI8660 WAS MISSING. SYSMOD BBISS26 WO

      FAILED.

      GIM37001S ** APPLY PROCESSING STOPPED BECAUSE FUNCTION SYSMOD BBACM20 FAILED.